{"text_format":"1","workbook":"xlsx","n_sheets":17,"sheets":["Development","Data Entry","Chlorine Summary Table","Chlorine Chart","Cl2 Delta Table","pH Summary Table","pH Chart","Temp Summary Table","Temp Chart","TTHM Summary Table","TTHM Chart","TTHM Goals","HAA5 Summary Table","HAA5 Chart","HAA5 Goals","OEL Calc","Site Info"],"not_rendered":{"charts":7,"images":0,"macros":1,"external_links":1,"defined_names":50,"comments":4,"pivot_tables":6},"unopened":[],"bounds":{"document_bytes":16777216,"sheet_cells":100000,"rows_first":2000,"rows_last":500,"rows_between":2000,"halvings":0,"cell_chars":16384,"cell_head_chars":4096},"cells_cut":0,"cells_raw":0,"read":"whole","date_system":"1900"}

{"sheet":"Development","index":0,"n_rows":21,"n_cols":3,"rows_kept":21,"cut":false,"hidden":true,"merged":[]}
["Column1","Column2","Version"]
["Developer Comments"]
[]
["2011-04-14","Modified GW spreadsheet to use for DS PBT. Added DBP pivot tables and charts. Added DBP goals"]
[null,"tables for TTHM and HAA5."]
["2011-04-29","Pivot tables set to automatically Refresh each time file is opened. Identifed method to display"]
[null,"system wide chlorine concentration by month by dragging Sample Site Field out of box."]
[null,"Added DBP long-term charts to goals worksheets."]
["2011-09-01","William McClimans added macro to auto update all pivot tables."]
["2012-01-04","Added macro to auto update DBP Goals table based on DBP pivot table quarterly summary table."]
{"$rows_left_out":12}
{"sheet":"Data Entry","index":1,"n_rows":110,"n_cols":45,"rows_kept":110,"cut":false,"hidden":false,"merged":[[0,10,1,13],[2,0,3,2],[2,5,2,6]]}
["Enter new sample data by inserting rows in table or entering data in the row immediately below the table.",null,null,null,null,null,null,null,null,null,"Water System Name"]
["Note: Avoid blank rows in the data entry table. Pivot tables and charts do not like blank rows!"]
["Operational Goals (Individual Samples)",null,null,null,null,"(min)  pH  (Max)"]
[null,null,null,0.2,null,6.8,7.8,7.0000000000000007E-2,0.05]
["Sample Site","Date","Time","Free Cl2, Mg/L","Total Cl2, Mg/L","Temp","pH","TTHM, Mg/L","HAA5, Mg/L","Other 3","Other 4","Other 5","Latitude","Longitude","Comments","CL2 Rounded"]
["11405 LARRY LAKE ROAD","2014-04-07",null,null,null,null,null,9.3699999999999999E-3,1.18E-2,null,null,null,null,null,null,{"$f":"VLOOKUP(Table6[[#This Row],[Free Cl2, Mg/L]],CL_RND_TBL[#All],2)","v":0}]
["13191 DEASON CAMP ROAD","2014-04-07",null,null,null,null,null,4.3799999999999999E-2,2.7300000000000001E-2,null,null,null,null,null,null,{"$f":"VLOOKUP(Table6[[#This Row],[Free Cl2, Mg/L]],CL_RND_TBL[#All],2)","v":0},null,null,null,null,null,null,null,null,null,null,null,null,null,null,null,null,null,null,null,null,null,null,null,null,null,null,null,"Chlorine","Result"]
["13920 GRAND POINTE ROAD","2014-04-07",null,null,null,null,null,2.8400000000000002E-2,2.4899999999999999E-2,null,null,null,null,null,null,{"$f":"VLOOKUP(Table6[[#This Row],[Free Cl2, Mg/L]],CL_RND_TBL[#All],2)","v":0},null,null,null,null,null,null,null,null,null,null,null,null,null,null,null,null,null,null,null,null,null,null,null,null,null,null,null,0,0]
["3950 3RD STREET SOUTH","2014-04-07",null,null,null,null,null,4.5100000000000001E-2,2.9899999999999999E-2,null,null,null,null,null,null,{"$f":"VLOOKUP(Table6[[#This Row],[Free Cl2, Mg/L]],CL_RND_TBL[#All],2)","v":0},null,null,null,null,null,null,null,null,null,null,null,null,null,null,null,null,null,null,null,null,null,null,null,null,null,null,null,0.01,0]
["6802 MCFARLAND BLVD","2014-04-07",null,null,null,null,null,4.4600000000000001E-2,0.03,null,null,null,null,null,null,{"$f":"VLOOKUP(Table6[[#This Row],[Free Cl2, Mg/L]],CL_RND_TBL[#All],2)","v":0},null,null,null,null,null,null,null,null,null,null,null,null,null,null,null,null,null,null,null,null,null,null,null,null,null,null,null,0.04,0]
{"$rows_left_out":101}
{"sheet":"Chlorine Summary Table","index":2,"n_rows":16,"n_cols":23,"rows_kept":16,"cut":false,"hidden":true,"merged":[[1,0,2,11]]}
[{"$f":"'Data Entry'!K1:K2","v":"Water System Name"}]
["Note:  If table is not updated go to the \"Data Entry\" tab and click the \"Update Tables\" button.  If table does not update, make sure that macros are enabled. Go to Trust Center & Macro Settings to enable macros."]
[]
["Average of Free Cl2, Mg/L","Years","Date"]
[null,"2014",null,null,"2015",null,null,null,"2016",null,null,null,"2017",null,null,null,"2018",null,null,null,"2019",null,"Average"]
["Sample Site","Apr","Jul","Oct","Jan","Apr","Jul","Oct","Jan","Apr","Jul","Oct","Jan","Apr","Jul","Oct","Jan","Apr","Jul","Oct","Jan","Apr"]
["#1 BOOTH ESTATES"]
["11405 LARRY LAKE ROAD"]
["13191 DEASON CAMP ROAD"]
["13920 GRAND POINTE ROAD"]
{"$rows_left_out":7}
{"sheet":"Chlorine Chart","index":3,"n_rows":0,"n_cols":0,"rows_kept":0,"cut":false,"hidden":false,"merged":[]}

{"sheet":"Cl2 Delta Table","index":4,"n_rows":25,"n_cols":6,"rows_kept":25,"cut":false,"hidden":true,"merged":[]}
["Sample Site","11405 LARRY LAKE ROAD",null,null,null,"Note: Update this table each time new data is entered in the Data Entry Table."]
[null,null,null,null,null,"To update, 'right clicking' on any cell in the table and select Refresh."]
["Delta Cl2",null,null,null,null,"Legend"]
["Date","Total",null,null,null,"Green Light: Delta less than or equal to 0.19"]
["2019-04-08",{"$error":"#NAME?"},null,null,null,"Yellow Light: Delta less than 0.25 and greater than 0.19"]
["2019-01-17",{"$error":"#NAME?"},null,null,null,"Red Light: Delta greater than or equal to 0.25 "]
["2018-10-08",{"$error":"#NAME?"}]
["2018-07-10",{"$error":"#NAME?"}]
["2018-04-09",{"$error":"#NAME?"}]
["2018-01-09",{"$error":"#NAME?"}]
{"$rows_left_out":16}
{"sheet":"pH Summary Table","index":5,"n_rows":16,"n_cols":23,"rows_kept":16,"cut":false,"hidden":true,"merged":[[1,0,2,11]]}
[{"$f":"'Data Entry'!K1:K2","v":"Water System Name"}]
["Note:  If table is not updated go to the \"Data Entry\" tab and click the \"Update Tables\" button.  If table does not update, make sure that macros are enabled. Go to Trust Center & Macro Settings to enable macros."]
[]
["Average of pH","Years","Date"]
[null,"2014",null,null,"2015",null,null,null,"2016",null,null,null,"2017",null,null,null,"2018",null,null,null,"2019",null,"Average"]
["Sample Site","Apr","Jul","Oct","Jan","Apr","Jul","Oct","Jan","Apr","Jul","Oct","Jan","Apr","Jul","Oct","Jan","Apr","Jul","Oct","Jan","Apr"]
["#1 BOOTH ESTATES"]
["11405 LARRY LAKE ROAD"]
["13191 DEASON CAMP ROAD"]
["13920 GRAND POINTE ROAD"]
{"$rows_left_out":7}
{"sheet":"pH Chart","index":6,"n_rows":0,"n_cols":0,"rows_kept":0,"cut":false,"hidden":false,"merged":[]}

{"sheet":"Temp Summary Table","index":7,"n_rows":16,"n_cols":23,"rows_kept":16,"cut":false,"hidden":true,"merged":[[1,0,2,11]]}
[{"$f":"'Data Entry'!K1:K2","v":"Water System Name"}]
["Note:  If table is not updated go to the \"Data Entry\" tab and click the \"Update Tables\" button.  If table does not update, make sure that macros are enabled. Go to Trust Center & Macro Settings to enable macros."]
[]
["Average of Temp","Years","Date"]
[null,"2014",null,null,"2015",null,null,null,"2016",null,null,null,"2017",null,null,null,"2018",null,null,null,"2019",null,"Average"]
["Sample Site","Apr","Jul","Oct","Jan","Apr","Jul","Oct","Jan","Apr","Jul","Oct","Jan","Apr","Jul","Oct","Jan","Apr","Jul","Oct","Jan","Apr"]
["#1 BOOTH ESTATES"]
["11405 LARRY LAKE ROAD"]
["13191 DEASON CAMP ROAD"]
["13920 GRAND POINTE ROAD"]
{"$rows_left_out":7}
{"sheet":"Temp Chart","index":8,"n_rows":0,"n_cols":0,"rows_kept":0,"cut":false,"hidden":false,"merged":[]}

{"sheet":"TTHM Summary Table","index":9,"n_rows":56,"n_cols":34,"rows_kept":56,"cut":false,"hidden":true,"merged":[[0,1,1,12]]}
[null,"Note:  If table is not updated go to the \"Data Entry\" tab and click the \"Update Tables\" button.  If table does not update, make sure that macros are enabled. Go to Trust Center & Macro Settings to enable macros.",null,null,null,null,null,null,null,null,null,null,null,{"$f":"'Data Entry'!K1:K2","v":"Water System Name"}]
[]
[null,"Average of TTHM, Mg/L","Years","Date"]
[null,null,"2014",null,null,"2015",null,null,null,"2016",null,null,null,"2017",null,null,null,"2018",null,null,null,"2019",null,"Average"]
[null,"Sample Site","Qtr2","Qtr3","Qtr4","Qtr1","Qtr2","Qtr3","Qtr4","Qtr1","Qtr2","Qtr3","Qtr4","Qtr1","Qtr2","Qtr3","Qtr4","Qtr1","Qtr2","Qtr3","Qtr4","Qtr1","Qtr2"]
[null,"11405 LARRY LAKE ROAD",9.3699999999999999E-3,1.78E-2,1.35E-2,8.8199999999999997E-3,1.0500000000000001E-2,1.67E-2,1.4200000000000001E-2,1.2500000000000001E-2,1.0999999999999999E-2,1.41E-2,8.6099999999999996E-3,6.2199999999999998E-3,1.77E-2,2.6599999999999999E-2,1.6E-2,8.6899999999999998E-3,1.4E-2,1.18E-2,2.5399999999999999E-2,1.47E-2,1.7299999999999999E-2,1.4071904761904761E-2]
[null,"13191 DEASON CAMP ROAD",4.3799999999999999E-2,8.4500000000000006E-2,4.24E-2,3.5799999999999998E-2,3.6900000000000002E-2,7.6899999999999996E-2,5.1900000000000002E-2,4.36E-2,3.2000000000000001E-2,6.4799999999999996E-2,4.2500000000000003E-2,2.3E-2,4.6699999999999998E-2,7.9299999999999995E-2,7.0599999999999996E-2,2.6599999999999999E-2,"na","na","na","na","na",5.0081250000000001E-2]
[null,"13920 GRAND POINTE ROAD",2.8400000000000002E-2,5.4600000000000003E-2,3.6799999999999999E-2,2.58E-2,2.5999999999999999E-2,4.19E-2,4.8000000000000001E-2,3.1099999999999999E-2,2.7E-2,6.3100000000000003E-2,2.9499999999999998E-2,1.8499999999999999E-2,3.8699999999999998E-2,5.1400000000000001E-2,5.0500000000000003E-2,1.7399999999999999E-2,"na","na","na","na","na",3.679375E-2]
[null,"3950 3RD STREET SOUTH",4.5100000000000001E-2,8.5800000000000001E-2,6.1400000000000003E-2,3.6799999999999999E-2,3.5400000000000001E-2,7.0699999999999999E-2,5.8999999999999997E-2,4.3700000000000003E-2,3.5999999999999997E-2,7.1099999999999997E-2,8.6099999999999996E-3,2.46E-2,4.9599999999999998E-2,8.2799999999999999E-2,6.4199999999999993E-2,2.86E-2,"na","na","na","na","na",5.021312499999999E-2]
[null,"6802 MCFARLAND BLVD",4.4600000000000001E-2,5.7599999999999998E-2,5.21E-2,3.5200000000000002E-2,3.6999999999999998E-2,7.6200000000000004E-2,4.4900000000000002E-2,4.3900000000000002E-2,3.7999999999999999E-2,6.0600000000000001E-2,4.3999999999999997E-2,2.2200000000000001E-2,3.8600000000000002E-2,7.6200000000000004E-2,5.3999999999999999E-2,2.4500000000000001E-2,"na","na","na","na","na",4.6850000000000003E-2]
{"$rows_left_out":47}
{"sheet":"TTHM Chart","index":10,"n_rows":0,"n_cols":0,"rows_kept":0,"cut":false,"hidden":false,"merged":[]}

{"sheet":"TTHM Goals","index":11,"n_rows":64,"n_cols":15,"rows_kept":64,"cut":false,"hidden":false,"merged":[[13,12,13,15]]}
["TTHM Goals Calculation"]
["If desired, the goals can be modified on a system-specific basis.  Default values are shown in the comment boxes below."]
["Individual Site Goal:",7.0000000000000007E-2]
["Long-Term System Goal:",0.06]
["Water System Name:",{"$f":"'Data Entry'!K1","v":"Water System Name"}]
["Yellow","highlighted LRAA exceeds TTHM Individual Site Goal (i.e., default goal is LRAA < 0.07 Mg/L) for that quarter"]
["Blue","highlighted LRAA is the max LRAA for that quarter; unless the LRAA exceeds the Individual Site Goal (see above)"]
["Green","highlighted data exceeds the TTHM Long-Term System Goal (i.e., default goal is ave Max LRAAs < 0.06 Mg/L)"]
[]
[null,{"$f":"B11&B12","v":"42016"},{"$f":"C11&C12","v":"12017"},"22017","32017","42017","12018","22018","32018","42018","12019","22019"]
{"$rows_left_out":55}
{"sheet":"HAA5 Summary Table","index":12,"n_rows":55,"n_cols":33,"rows_kept":55,"cut":false,"hidden":true,"merged":[[0,0,1,11]]}
["Note:  If table is not updated go to the \"Data Entry\" tab and click the \"Update Tables\" button.  If table does not update, make sure that macros are enabled. Go to Trust Center & Macro Settings to enable macros.",null,null,null,null,null,null,null,null,null,null,null,null,{"$f":"'Data Entry'!K1:K2","v":"Water System Name"}]
[]
["Average of HAA5, Mg/L","Years","Date"]
[null,"2014",null,null,"2015",null,null,null,"2016",null,null,null,"2017",null,null,null,"2018",null,null,null,"2019",null,"Average"]
["Sample Site","Qtr2","Qtr3","Qtr4","Qtr1","Qtr2","Qtr3","Qtr4","Qtr1","Qtr2","Qtr3","Qtr4","Qtr1","Qtr2","Qtr3","Qtr4","Qtr1","Qtr2","Qtr3","Qtr4","Qtr1","Qtr2"]
["11405 LARRY LAKE ROAD",1.18E-2,1.2699999999999999E-2,1.12E-2,1.66E-2,0.01,1.6799999999999999E-2,1.2800000000000001E-2,2.0199999999999999E-2,1.4E-2,1.72E-2,9.6900000000000007E-3,7.4200000000000004E-3,1.9300000000000001E-2,3.2800000000000003E-2,1.38E-2,9.0699999999999999E-3,1.6199999999999999E-2,1.47E-2,2.2499999999999999E-2,2.2200000000000001E-2,2.1999999999999999E-2,1.5856190476190479E-2]
["13191 DEASON CAMP ROAD",2.7300000000000001E-2,6.2799999999999995E-2,3.6400000000000002E-2,3.56E-2,2.9600000000000001E-2,4.9500000000000002E-2,3.3599999999999998E-2,5.04E-2,3.2000000000000001E-2,4.6100000000000002E-2,3.7600000000000001E-2,2.0199999999999999E-2,3.78E-2,6.13E-2,4.4299999999999999E-2,2.01E-2,"na","na","na","na","na",3.9037500000000003E-2]
["13920 GRAND POINTE ROAD",2.4899999999999999E-2,4.7E-2,2.41E-2,3.1600000000000003E-2,1.9E-2,3.4200000000000001E-2,2.9100000000000001E-2,4.9500000000000002E-2,2.9000000000000001E-2,4.7800000000000002E-2,2.7400000000000001E-2,1.7999999999999999E-2,3.5000000000000003E-2,4.7699999999999999E-2,3.8399999999999997E-2,1.52E-2,"na","na","na","na","na",3.2368750000000002E-2]
["3950 3RD STREET SOUTH",2.9899999999999999E-2,6.0900000000000003E-2,3.9800000000000002E-2,3.4500000000000003E-2,2.7199999999999998E-2,4.9599999999999998E-2,3.85E-2,4.99E-2,3.5999999999999997E-2,4.6399999999999997E-2,9.6900000000000007E-3,1.84E-2,4.3499999999999997E-2,6.1699999999999998E-2,4.4400000000000002E-2,1.9099999999999999E-2,"na","na","na","na","na",3.8093124999999992E-2]
["6802 MCFARLAND BLVD",0.03,5.1700000000000003E-2,3.8600000000000002E-2,3.2899999999999999E-2,2.98E-2,4.82E-2,3.4099999999999998E-2,4.99E-2,3.4000000000000002E-2,4.2900000000000001E-2,3.6600000000000001E-2,2.1899999999999999E-2,4.1200000000000001E-2,6.08E-2,4.7899999999999998E-2,1.8200000000000001E-2,"na","na","na","na","na",3.8668750000000002E-2]
{"$rows_left_out":46}
{"sheet":"HAA5 Chart","index":13,"n_rows":0,"n_cols":0,"rows_kept":0,"cut":false,"hidden":false,"merged":[]}

{"sheet":"HAA5 Goals","index":14,"n_rows":64,"n_cols":15,"rows_kept":64,"cut":false,"hidden":false,"merged":[]}
["HAA5 Goals Calculation"]
["If desired, the goals can be modified on a system-specific basis.  Default values are shown in the comment boxes below."]
["Individual Site Goal:",0.05]
["Long-Term System Goal:",0.04]
["Water System Name:",{"$f":"'TTHM Goals'!B5","v":"Water System Name"}]
["Yellow","highlighted LRAA exceeds TTHM Individual Site Goal (i.e., default goal is LRAA < 0.050 Mg/L) for that quarter"]
["Blue","highlighted LRAA is the max LRAA for that quarter; unless the LRAA exceeds the Individual Site Goal (see above)"]
["Green","highlighted data exceeds the TTHM Long-Term System Goal (i.e., default goal is ave Max LRAAs < 0.04 Mg/L)"]
[]
[null,{"$f":"B11&B12","v":"42016"},{"$f":"C11&C12","v":"12017"},"22017","32017","42017","12018","22018","32018","42018","12019","22019"]
{"$rows_left_out":55}
{"sheet":"OEL Calc","index":15,"n_rows":45,"n_cols":13,"rows_kept":45,"cut":false,"hidden":false,"merged":[]}
[null,{"$f":"'Data Entry'!K1:K2","v":"Water System Name"}]
[]
[null,"TTHM OEL Table"]
[null,"Operational Evaluation Level (OEL)",8.0399999999999999E-2,"Colored cell indicates OEL was exceeded"]
[null,null,{"$f":"'TTHM Goals'!B13","v":"Q4 2016"},{"$f":"'TTHM Goals'!C13","v":"Q1 2017"},{"$f":"'TTHM Goals'!D13","v":"Q2 2017"},{"$f":"'TTHM Goals'!E13","v":"Q3 2017"},{"$f":"'TTHM Goals'!F13","v":"Q4 2017"},{"$f":"'TTHM Goals'!G13","v":"Q1 2018"},{"$f":"'TTHM Goals'!H13","v":"Q2 2018"},{"$f":"'TTHM Goals'!I13","v":"Q3 2018"},{"$f":"'TTHM Goals'!J13","v":"Q4 2018"},{"$f":"'TTHM Goals'!K13","v":"Q1 2019"},{"$f":"'TTHM Goals'!L13","v":"Q2 2019"}]
[null,{"$f":"IF(ISBLANK('TTHM Goals'!A14),\"\",'TTHM Goals'!A14)","v":"11405 LARRY LAKE ROAD"},null,null,{"$f":"IF(ISERROR(('TTHM Goals'!D14*2+SUM('TTHM Goals'!B14:C14))/4),\"\",(('TTHM Goals'!D14*2+SUM('TTHM Goals'!B14:C14))/4))","v":1.2557499999999999E-2},{"$f":"IF(ISERROR(('TTHM Goals'!E14*2+SUM('TTHM Goals'!C14:D14))/4),\"\",(('TTHM Goals'!E14*2+SUM('TTHM Goals'!C14:D14))/4))","v":1.9279999999999999E-2},{"$f":"IF(ISERROR(('TTHM Goals'!F14*2+SUM('TTHM Goals'!D14:E14))/4),\"\",(('TTHM Goals'!F14*2+SUM('TTHM Goals'!D14:E14))/4))","v":1.9075000000000002E-2},{"$f":"IF(ISERROR(('TTHM Goals'!G14*2+SUM('TTHM Goals'!E14:F14))/4),\"\",(('TTHM Goals'!G14*2+SUM('TTHM Goals'!E14:F14))/4))","v":1.4995E-2},{"$f":"IF(ISERROR(('TTHM Goals'!H14*2+SUM('TTHM Goals'!F14:G14))/4),\"\",(('TTHM Goals'!H14*2+SUM('TTHM Goals'!F14:G14))/4))","v":1.31725E-2},{"$f":"IF(ISERROR(('TTHM Goals'!I14*2+SUM('TTHM Goals'!G14:H14))/4),\"\",(('TTHM Goals'!I14*2+SUM('TTHM Goals'!G14:H14))/4))","v":1.1572499999999999E-2},{"$f":"IF(ISERROR(('TTHM Goals'!J14*2+SUM('TTHM Goals'!H14:I14))/4),\"\",(('TTHM Goals'!J14*2+SUM('TTHM Goals'!H14:I14))/4))","v":1.915E-2},{"$f":"IF(ISERROR(('TTHM Goals'!K14*2+SUM('TTHM Goals'!I14:J14))/4),\"\",(('TTHM Goals'!K14*2+SUM('TTHM Goals'!I14:J14))/4))","v":1.6649999999999998E-2},{"$f":"IF(ISERROR(('TTHM Goals'!L14*2+SUM('TTHM Goals'!J14:K14))/4),\"\",(('TTHM Goals'!L14*2+SUM('TTHM Goals'!J14:K14))/4))","v":1.8674999999999997E-2}]
[null,{"$f":"IF(ISBLANK('TTHM Goals'!A15),\"\",'TTHM Goals'!A15)","v":"13191 DEASON CAMP ROAD"},null,null,{"$f":"IF(ISERROR(('TTHM Goals'!D15*2+SUM('TTHM Goals'!B15:C15))/4),\"\",(('TTHM Goals'!D15*2+SUM('TTHM Goals'!B15:C15))/4))","v":3.9724999999999996E-2},{"$f":"IF(ISERROR(('TTHM Goals'!E15*2+SUM('TTHM Goals'!C15:D15))/4),\"\",(('TTHM Goals'!E15*2+SUM('TTHM Goals'!C15:D15))/4))","v":5.7075000000000001E-2},{"$f":"IF(ISERROR(('TTHM Goals'!F15*2+SUM('TTHM Goals'!D15:E15))/4),\"\",(('TTHM Goals'!F15*2+SUM('TTHM Goals'!D15:E15))/4))","v":6.6799999999999998E-2},{"$f":"IF(ISERROR(('TTHM Goals'!G15*2+SUM('TTHM Goals'!E15:F15))/4),\"\",(('TTHM Goals'!G15*2+SUM('TTHM Goals'!E15:F15))/4))","v":5.0774999999999994E-2},{"$f":"IF(ISERROR(('TTHM Goals'!H15*2+SUM('TTHM Goals'!F15:G15))/4),\"\",(('TTHM Goals'!H15*2+SUM('TTHM Goals'!F15:G15))/4))","v":""},{"$f":"IF(ISERROR(('TTHM Goals'!I15*2+SUM('TTHM Goals'!G15:H15))/4),\"\",(('TTHM Goals'!I15*2+SUM('TTHM Goals'!G15:H15))/4))","v":""},{"$f":"IF(ISERROR(('TTHM Goals'!J15*2+SUM('TTHM Goals'!H15:I15))/4),\"\",(('TTHM Goals'!J15*2+SUM('TTHM Goals'!H15:I15))/4))","v":""},{"$f":"IF(ISERROR(('TTHM Goals'!K15*2+SUM('TTHM Goals'!I15:J15))/4),\"\",(('TTHM Goals'!K15*2+SUM('TTHM Goals'!I15:J15))/4))","v":""},{"$f":"IF(ISERROR(('TTHM Goals'!L15*2+SUM('TTHM Goals'!J15:K15))/4),\"\",(('TTHM Goals'!L15*2+SUM('TTHM Goals'!J15:K15))/4))","v":""}]
[null,{"$f":"IF(ISBLANK('TTHM Goals'!A16),\"\",'TTHM Goals'!A16)","v":"13920 GRAND POINTE ROAD"},null,null,{"$f":"IF(ISERROR(('TTHM Goals'!D16*2+SUM('TTHM Goals'!B16:C16))/4),\"\",(('TTHM Goals'!D16*2+SUM('TTHM Goals'!B16:C16))/4))","v":3.1350000000000003E-2},{"$f":"IF(ISERROR(('TTHM Goals'!E16*2+SUM('TTHM Goals'!C16:D16))/4),\"\",(('TTHM Goals'!E16*2+SUM('TTHM Goals'!C16:D16))/4))","v":0.04},{"$f":"IF(ISERROR(('TTHM Goals'!F16*2+SUM('TTHM Goals'!D16:E16))/4),\"\",(('TTHM Goals'!F16*2+SUM('TTHM Goals'!D16:E16))/4))","v":4.7774999999999998E-2},{"$f":"IF(ISERROR(('TTHM Goals'!G16*2+SUM('TTHM Goals'!E16:F16))/4),\"\",(('TTHM Goals'!G16*2+SUM('TTHM Goals'!E16:F16))/4))","v":3.4174999999999997E-2},{"$f":"IF(ISERROR(('TTHM Goals'!H16*2+SUM('TTHM Goals'!F16:G16))/4),\"\",(('TTHM Goals'!H16*2+SUM('TTHM Goals'!F16:G16))/4))","v":""},{"$f":"IF(ISERROR(('TTHM Goals'!I16*2+SUM('TTHM Goals'!G16:H16))/4),\"\",(('TTHM Goals'!I16*2+SUM('TTHM Goals'!G16:H16))/4))","v":""},{"$f":"IF(ISERROR(('TTHM Goals'!J16*2+SUM('TTHM Goals'!H16:I16))/4),\"\",(('TTHM Goals'!J16*2+SUM('TTHM Goals'!H16:I16))/4))","v":""},{"$f":"IF(ISERROR(('TTHM Goals'!K16*2+SUM('TTHM Goals'!I16:J16))/4),\"\",(('TTHM Goals'!K16*2+SUM('TTHM Goals'!I16:J16))/4))","v":""},{"$f":"IF(ISERROR(('TTHM Goals'!L16*2+SUM('TTHM Goals'!J16:K16))/4),\"\",(('TTHM Goals'!L16*2+SUM('TTHM Goals'!J16:K16))/4))","v":""}]
[null,{"$f":"IF(ISBLANK('TTHM Goals'!A17),\"\",'TTHM Goals'!A17)","v":"3950 3RD STREET SOUTH"},null,null,{"$f":"IF(ISERROR(('TTHM Goals'!D17*2+SUM('TTHM Goals'!B17:C17))/4),\"\",(('TTHM Goals'!D17*2+SUM('TTHM Goals'!B17:C17))/4))","v":3.31025E-2},{"$f":"IF(ISERROR(('TTHM Goals'!E17*2+SUM('TTHM Goals'!C17:D17))/4),\"\",(('TTHM Goals'!E17*2+SUM('TTHM Goals'!C17:D17))/4))","v":5.9950000000000003E-2},{"$f":"IF(ISERROR(('TTHM Goals'!F17*2+SUM('TTHM Goals'!D17:E17))/4),\"\",(('TTHM Goals'!F17*2+SUM('TTHM Goals'!D17:E17))/4))","v":6.5199999999999994E-2},{"$f":"IF(ISERROR(('TTHM Goals'!G17*2+SUM('TTHM Goals'!E17:F17))/4),\"\",(('TTHM Goals'!G17*2+SUM('TTHM Goals'!E17:F17))/4))","v":5.1049999999999998E-2},{"$f":"IF(ISERROR(('TTHM Goals'!H17*2+SUM('TTHM Goals'!F17:G17))/4),\"\",(('TTHM Goals'!H17*2+SUM('TTHM Goals'!F17:G17))/4))","v":""},{"$f":"IF(ISERROR(('TTHM Goals'!I17*2+SUM('TTHM Goals'!G17:H17))/4),\"\",(('TTHM Goals'!I17*2+SUM('TTHM Goals'!G17:H17))/4))","v":""},{"$f":"IF(ISERROR(('TTHM Goals'!J17*2+SUM('TTHM Goals'!H17:I17))/4),\"\",(('TTHM Goals'!J17*2+SUM('TTHM Goals'!H17:I17))/4))","v":""},{"$f":"IF(ISERROR(('TTHM Goals'!K17*2+SUM('TTHM Goals'!I17:J17))/4),\"\",(('TTHM Goals'!K17*2+SUM('TTHM Goals'!I17:J17))/4))","v":""},{"$f":"IF(ISERROR(('TTHM Goals'!L17*2+SUM('TTHM Goals'!J17:K17))/4),\"\",(('TTHM Goals'!L17*2+SUM('TTHM Goals'!J17:K17))/4))","v":""}]
[null,{"$f":"IF(ISBLANK('TTHM Goals'!A18),\"\",'TTHM Goals'!A18)","v":"6802 MCFARLAND BLVD"},null,null,{"$f":"IF(ISERROR(('TTHM Goals'!D18*2+SUM('TTHM Goals'!B18:C18))/4),\"\",(('TTHM Goals'!D18*2+SUM('TTHM Goals'!B18:C18))/4))","v":3.585E-2},{"$f":"IF(ISERROR(('TTHM Goals'!E18*2+SUM('TTHM Goals'!C18:D18))/4),\"\",(('TTHM Goals'!E18*2+SUM('TTHM Goals'!C18:D18))/4))","v":5.33E-2},{"$f":"IF(ISERROR(('TTHM Goals'!F18*2+SUM('TTHM Goals'!D18:E18))/4),\"\",(('TTHM Goals'!F18*2+SUM('TTHM Goals'!D18:E18))/4))","v":5.57E-2},{"$f":"IF(ISERROR(('TTHM Goals'!G18*2+SUM('TTHM Goals'!E18:F18))/4),\"\",(('TTHM Goals'!G18*2+SUM('TTHM Goals'!E18:F18))/4))","v":4.4800000000000006E-2},{"$f":"IF(ISERROR(('TTHM Goals'!H18*2+SUM('TTHM Goals'!F18:G18))/4),\"\",(('TTHM Goals'!H18*2+SUM('TTHM Goals'!F18:G18))/4))","v":""},{"$f":"IF(ISERROR(('TTHM Goals'!I18*2+SUM('TTHM Goals'!G18:H18))/4),\"\",(('TTHM Goals'!I18*2+SUM('TTHM Goals'!G18:H18))/4))","v":""},{"$f":"IF(ISERROR(('TTHM Goals'!J18*2+SUM('TTHM Goals'!H18:I18))/4),\"\",(('TTHM Goals'!J18*2+SUM('TTHM Goals'!H18:I18))/4))","v":""},{"$f":"IF(ISERROR(('TTHM Goals'!K18*2+SUM('TTHM Goals'!I18:J18))/4),\"\",(('TTHM Goals'!K18*2+SUM('TTHM Goals'!I18:J18))/4))","v":""},{"$f":"IF(ISERROR(('TTHM Goals'!L18*2+SUM('TTHM Goals'!J18:K18))/4),\"\",(('TTHM Goals'!L18*2+SUM('TTHM Goals'!J18:K18))/4))","v":""}]
{"$rows_left_out":36}
{"sheet":"Site Info","index":16,"n_rows":19,"n_cols":5,"rows_kept":19,"cut":false,"hidden":true,"merged":[]}
[null,"Note:  Change W longitude to negative value"]
[null,"Enter water qaulity data (e.g., chlorine residual) to plot in GE Graph from a summary table worksheet."]
[null,"Name","Latitude","Longitude","Value"]
[null,"EP",35.493000000000002,-94.221999999999994,1.25]
[null,"S5",35.499600000000001,-94.258799999999994,0.68]
[]
[]
[]
[]
[]
{"$rows_left_out":9}